Reaction Details
TargetPoly [ADP-ribose] polymerase tankyrase-2
LigandBDBM50250878
Substrate/Competitorn/a
Meas. Tech.ChEBML_1682547
IC50 9.8±n/a nM
Citation Anumala, URWaaler, JNkizinkiko, YIgnatev, ALazarow, KLindemann, POlsen, PAMurthy, SObaji, EMajouga, AGLeonov, Svon Kries, JPLehtiö, LKrauss, SNazaré, M Discovery of a Novel Series of Tankyrase Inhibitors by a Hybridization Approach. J Med Chem60:10013-10025 (2017) 
 
Poly [ADP-ribose] polymerase tankyrase-2
Name:Poly [ADP-ribose] polymerase tankyrase-2
Type:Enzyme
Mol. Mass.:126937.16
Organism:Homo sapiens (Human)
Description:Q9H2K2
Residue:1166
BDBM50250878
NameBDBM50250878
Synonyms:CHEMBL4074540
TypeSmall organic molecule
Emp. Form.C23H18ClN7O
Mol. Mass.443.888
SMILESClc1ccccc1-n1c(nnc1-c1ccncn1)[C@H]1C[C@@H](C1)n1c2ccccc2[nH]c1=O