Reaction Details
TargetPoly [ADP-ribose] polymerase 1
LigandBDBM50250875
Substrate/Competitorn/a
Meas. Tech.ChEBML_1682550
IC50>100000±n/a nM
Citation Anumala, URWaaler, JNkizinkiko, YIgnatev, ALazarow, KLindemann, POlsen, PAMurthy, SObaji, EMajouga, AGLeonov, Svon Kries, JPLehtiö, LKrauss, SNazaré, M Discovery of a Novel Series of Tankyrase Inhibitors by a Hybridization Approach. J Med Chem60:10013-10025 (2017) 
 
Poly [ADP-ribose] polymerase 1
Name:Poly [ADP-ribose] polymerase 1
Type:n/a
Mol. Mass.:113114.22
Organism:Homo sapiens (Human)
Description:P09874
Residue:1014
BDBM50250875
NameBDBM50250875
Synonyms:CHEMBL4095003
TypeSmall organic molecule
Emp. Form.C24H17ClN8O
Mol. Mass.468.898
SMILESClc1ccccc1-n1c(nnc1-c1ccncn1)[C@H]1C[C@@H](C1)n1c2ccc(cc2[nH]c1=O)C#N