Reaction Details
TargetNon-receptor tyrosine-protein kinase TYK2
LigandBDBM50250919
Substrate/Competitorn/a
Meas. Tech.ChEBML_1682728
IC50 0.700000±n/a nM
Citation Siu, TBrubaker, JFuller, PTorres, LZeng, HClose, JMampreian, DMShi, FLiu, DFradera, XJohnson, KBays, NKadic, EHe, FGoldenblatt, PShaffer, LPatel, SBLesburg, CAAlpert, CDorosh, LDeshmukh, SVYu, HKlappenbach, JElwood, FDinsmore, CJFernandez, RMoy, LYoung, JR The Discovery of 3-((4-Chloro-3-methoxyphenyl)amino)-1-((3R,4S)-4-cyanotetrahydro-2H-pyran-3-yl)-1H-pyrazole-4-carboxamide, a Highly Ligand Efficient and Efficacious Janus Kinase 1 Selective Inhibitor with Favorable Pharmacokinetic Properties. J Med Chem60:9676-9690 (2017) 
 
Non-receptor tyrosine-protein kinase TYK2
Name:Non-receptor tyrosine-protein kinase TYK2
Type:Protein
Mol. Mass.:133666.03
Organism:Homo sapiens (Human)
Description:P29597
Residue:1187
BDBM50250919
NameBDBM50250919
Synonyms:CHEMBL4102140
TypeSmall organic molecule
Emp. Form.C17H17F2N5O3
Mol. Mass.377.3454
SMILESNC(=O)c1cn(nc1Nc1ccc(OC(F)F)cc1)[C@H]1COCC[C@@H]1C#N