Reaction Details
TargetTyrosine-protein kinase JAK2
LigandBDBM50250922
Substrate/Competitorn/a
Meas. Tech.ChEBML_1682730
IC50 0.700000±n/a nM
Citation Siu, TBrubaker, JFuller, PTorres, LZeng, HClose, JMampreian, DMShi, FLiu, DFradera, XJohnson, KBays, NKadic, EHe, FGoldenblatt, PShaffer, LPatel, SBLesburg, CAAlpert, CDorosh, LDeshmukh, SVYu, HKlappenbach, JElwood, FDinsmore, CJFernandez, RMoy, LYoung, JR The Discovery of 3-((4-Chloro-3-methoxyphenyl)amino)-1-((3R,4S)-4-cyanotetrahydro-2H-pyran-3-yl)-1H-pyrazole-4-carboxamide, a Highly Ligand Efficient and Efficacious Janus Kinase 1 Selective Inhibitor with Favorable Pharmacokinetic Properties. J Med Chem60:9676-9690 (2017) 
 
Tyrosine-protein kinase JAK2
Name:Tyrosine-protein kinase JAK2
Type:Protein
Mol. Mass.:130684.68
Organism:Homo sapiens (Human)
Description:O60674
Residue:1132
BDBM50250922
NameBDBM50250922
Synonyms:CHEMBL4096821
TypeSmall organic molecule
Emp. Form.C18H18N8O2
Mol. Mass.378.3879
SMILESNC(=O)c1cn(nc1Nc1ccc(cc1)-n1ccnn1)[C@H]1COCC[C@@H]1C#N