Reaction Details
TargetAdenosylhomocysteinase
LigandBDBM50006216
Substrate/Competitorn/a
Meas. Tech.ChEBML_196726
Ki 67600±n/a nM
Citation Wolfe, MSLee, YBartlett, WJBorcherding, DRBorchardt, RT 4'-modified analogues of aristeromycin and neplanocin A: synthesis and inhibitory activity toward S-adenosyl-L-homocysteine hydrolase. J Med Chem35:1782-91 (1992) Adenosylhomocysteinase
Name:Adenosylhomocysteinase
Type:PROTEIN
Mol. Mass.:47714.06
Organism:Homo sapiens (Human)
Description:ChEMBL_1507791
Residue:432
BDBM50006216
NameBDBM50006216
Synonyms:3-(6-Amino-purin-9-yl)-5-phenyl-cyclopentane-1,2-diol | CHEMBL298188
TypeSmall organic molecule
Emp. Form.C16H17N5O2
Mol. Mass.311.3385
SMILESNc1ncnc2n(cnc12)[C@@H]1C[C@@H]([C@@H](O)[C@H]1O)c1ccccc1