Reaction Details
TargetAdenosylhomocysteinase
LigandBDBM50006219
Substrate/Competitorn/a
Meas. Tech.ChEBML_196726
Ki 5020.0±n/a nM
Citation Wolfe, MSLee, YBartlett, WJBorcherding, DRBorchardt, RT 4'-modified analogues of aristeromycin and neplanocin A: synthesis and inhibitory activity toward S-adenosyl-L-homocysteine hydrolase. J Med Chem35:1782-91 (1992) Adenosylhomocysteinase
Name:Adenosylhomocysteinase
Type:PROTEIN
Mol. Mass.:47714.06
Organism:Homo sapiens (Human)
Description:ChEMBL_1507791
Residue:432
BDBM50006219
NameBDBM50006219
Synonyms:3-(6-Amino-purin-9-yl)-5-methyl-cyclopentane-1,2-diol | CHEMBL299999
TypeSmall organic molecule
Emp. Form.C11H15N5O2
Mol. Mass.249.2691
SMILESC[C@@H]1C[C@H]([C@H](O)[C@@H]1O)n1cnc2c(N)ncnc12