Reaction Details
TargetSerine/threonine-protein kinase PAK 4
LigandBDBM50251154
Substrate/Competitorn/a
Meas. Tech.ChEMBL_1683091 (CHEMBL4033368)
Ki 2408±n/a nM
Citation Hao, CZhao, FSong, HGuo, JLi, XJiang, XHuan, RSong, SZhang, QWang, RWang, KPang, YLiu, TLu, THuang, WWang, JLin, BHe, ZLi, HLi, FZhao, DCheng, M Structure-Based Design of 6-Chloro-4-aminoquinazoline-2-carboxamide Derivatives as Potent and Selective p21-Activated Kinase 4 (PAK4) Inhibitors. J Med Chem61:265-285 (2018) 
 
Serine/threonine-protein kinase PAK 4
Name:Serine/threonine-protein kinase PAK 4
Type:Protein
Mol. Mass.:64098.01
Organism:Homo sapiens (Human)
Description:O96013
Residue:591
BDBM50251154
NameBDBM50251154
Synonyms:CHEMBL4095155
TypeSmall organic molecule
Emp. Form.C17H16ClN7O2
Mol. Mass.385.808
SMILESCc1cc(Nc2nc(nc3ccc(Cl)cc23)C(=O)N2CCNC(=O)C2)n[nH]1