Reaction Details
TargetSerine/threonine-protein kinase PAK 4
LigandBDBM50251177
Substrate/Competitorn/a
Meas. Tech.ChEMBL_1683091 (CHEMBL4033368)
Ki 114±n/a nM
Citation Hao, CZhao, FSong, HGuo, JLi, XJiang, XHuan, RSong, SZhang, QWang, RWang, KPang, YLiu, TLu, THuang, WWang, JLin, BHe, ZLi, HLi, FZhao, DCheng, M Structure-Based Design of 6-Chloro-4-aminoquinazoline-2-carboxamide Derivatives as Potent and Selective p21-Activated Kinase 4 (PAK4) Inhibitors. J Med Chem61:265-285 (2018) 
 
Serine/threonine-protein kinase PAK 4
Name:Serine/threonine-protein kinase PAK 4
Type:Protein
Mol. Mass.:64098.01
Organism:Homo sapiens (Human)
Description:O96013
Residue:591
BDBM50251177
NameBDBM50251177
Synonyms:CHEMBL4090268
TypeSmall organic molecule
Emp. Form.C21H24ClN7O
Mol. Mass.425.915
SMILESCC1CN(CC(C)N1)C(=O)c1nc(Nc2cc([nH]n2)C2CC2)c2cc(Cl)ccc2n1