Reaction Details
TargetDual specificity tyrosine-phosphorylation-regulated kinase 1A
LigandBDBM50251453
Substrate/Competitorn/a
Meas. Tech.ChEBML_1683762
IC50 1.000000±n/a nM
Citation Shaw, SJGoff, DALin, NSingh, RLi, WMcLaughlin, JBaltgalvis, KAPayan, DGKinsella, TM Developing DYRK inhibitors derived from the meridianins as a means of increasing levels of NFAT in the nucleus. Bioorg Med Chem Lett27:2617-2621 (2017) 
 
Dual specificity tyrosine-phosphorylation-regulated kinase 1A
Name:Dual specificity tyrosine-phosphorylation-regulated kinase 1A
Type:Enzyme
Mol. Mass.:85616.61
Organism:Homo sapiens (Human)
Description:Q13627
Residue:763
BDBM50251453
NameBDBM50251453
Synonyms:CHEMBL4079572
TypeSmall organic molecule
Emp. Form.C11H9N5
Mol. Mass.211.2227
SMILESNc1nccc(n1)-c1c[nH]c2cnccc12