Reaction Details
TargetDual specificity tyrosine-phosphorylation-regulated kinase 1A
LigandBDBM50251477
Substrate/Competitorn/a
Meas. Tech.ChEBML_1683762
IC50 61±n/a nM
Citation Shaw, SJGoff, DALin, NSingh, RLi, WMcLaughlin, JBaltgalvis, KAPayan, DGKinsella, TM Developing DYRK inhibitors derived from the meridianins as a means of increasing levels of NFAT in the nucleus. Bioorg Med Chem Lett27:2617-2621 (2017) 
 
Dual specificity tyrosine-phosphorylation-regulated kinase 1A
Name:Dual specificity tyrosine-phosphorylation-regulated kinase 1A
Type:Enzyme
Mol. Mass.:85616.61
Organism:Homo sapiens (Human)
Description:Q13627
Residue:763
BDBM50251477
NameBDBM50251477
Synonyms:CHEMBL4075648
TypeSmall organic molecule
Emp. Form.C12H8ClN3
Mol. Mass.229.665
SMILESClc1cnccc1-c1c[nH]c2cnccc12