Reaction Details
TargetDual specificity tyrosine-phosphorylation-regulated kinase 1A
LigandBDBM50081190
Substrate/Competitorn/a
Meas. Tech.ChEBML_1683762
IC50 19±n/a nM
Citation Shaw, SJGoff, DALin, NSingh, RLi, WMcLaughlin, JBaltgalvis, KAPayan, DGKinsella, TM Developing DYRK inhibitors derived from the meridianins as a means of increasing levels of NFAT in the nucleus. Bioorg Med Chem Lett27:2617-2621 (2017) 
 
Dual specificity tyrosine-phosphorylation-regulated kinase 1A
Name:Dual specificity tyrosine-phosphorylation-regulated kinase 1A
Type:Enzyme
Mol. Mass.:85616.61
Organism:Homo sapiens (Human)
Description:Q13627
Residue:763
BDBM50081190
NameBDBM50081190
Synonyms:CHEMBL3421979
TypeSmall organic molecule
Emp. Form.C12H10N4
Mol. Mass.210.2346
SMILESCc1nccc(n1)-c1c[nH]c2cnccc12