Reaction Details
TargetMuscarinic acetylcholine receptor M1
LigandBDBM50006546
Substrate/Competitorn/a
Meas. Tech.ChEBML_138935
Ki 18900±n/a nM
Citation Carroll, FIAbraham, PChemburkar, SHe, XCMascarella, SWKwon, YWTriggle, DJ Synthesis and muscarinic receptor activity of ester derivatives of 2-substituted 2-azabicyclo[2.2.1]heptan-5-ol and -6-ol. J Med Chem35:2184-91 (1992) Muscarinic acetylcholine receptor M1
Name:Muscarinic acetylcholine receptor M1
Type:Enzyme Catalytic Domain
Mol. Mass.:51390.46
Organism:RAT
Description:P08482
Residue:460
BDBM50006546
NameBDBM50006546
Synonyms:Acetic acid 2-benzyl-2-aza-bicyclo[2.2.1]hept-5-yl ester | CHEMBL67700
TypeSmall organic molecule
Emp. Form.C15H19NO2
Mol. Mass.245.3169
SMILESCC(=O)OC1CC2CC1CN2Cc1ccccc1