Reaction Details
TargetMuscarinic acetylcholine receptor M1
LigandBDBM50453188
Substrate/Competitorn/a
Meas. Tech.ChEBML_138935
Ki 0.876000±n/a nM
Citation Carroll, FIAbraham, PChemburkar, SHe, XCMascarella, SWKwon, YWTriggle, DJ Synthesis and muscarinic receptor activity of ester derivatives of 2-substituted 2-azabicyclo[2.2.1]heptan-5-ol and -6-ol. J Med Chem35:2184-91 (1992) Muscarinic acetylcholine receptor M1
Name:Muscarinic acetylcholine receptor M1
Type:Enzyme Catalytic Domain
Mol. Mass.:51390.46
Organism:RAT
Description:P08482
Residue:460
BDBM50453188
NameBDBM50453188
Synonyms:CHEMBL2115124
TypeSmall organic molecule
Emp. Form.C22H25NO2
Mol. Mass.335.4394
SMILESCN1CC2CC1C[C@@H]2OC(=O)C(C)(c1ccccc1)c1ccccc1