Reaction Details
TargetMuscarinic acetylcholine receptor M1
LigandBDBM50006582
Substrate/Competitorn/a
Meas. Tech.ChEBML_138793
IC50 0.900000±n/a nM
Citation Sauerberg, POlesen, PHNielsen, STreppendahl, SSheardown, MJHonoré, TMitch, CHWard, JSPike, AJBymaster, FP Novel functional M1 selective muscarinic agonists. Synthesis and structure-activity relationships of 3-(1,2,5-thiadiazolyl)-1,2,5,6-tetrahydro-1-methylpyridines . J Med Chem35:2274-83 (1992) Muscarinic acetylcholine receptor M1
Name:Muscarinic acetylcholine receptor M1
Type:Enzyme Catalytic Domain
Mol. Mass.:51390.46
Organism:RAT
Description:P08482
Residue:460
BDBM50006582
NameBDBM50006582
Synonyms:1-Methyl-5-(4-propylsulfanyl-[1,2,5]thiadiazol-3-yl)-1,2,3,6-tetrahydro-pyridine; oxalic acid | CHEMBL308772
TypeSmall organic molecule
Emp. Form.C11H17N3S2
Mol. Mass.255.403
SMILESCCCSc1nsnc1C1=CCCN(C)C1