Reaction Details
TargetM-phase inducer phosphatase 1
LigandBDBM50251708
Substrate/Competitorn/a
Meas. Tech.ChEBML_1684262
IC50 4330±n/a nM
Citation Zwergel, CCzepukojc, BEvain-Bana, EXu, ZStazi, GMori, MPatsilinakos, AMai, ABotta, BRagno, RBagrel, DKirsch, GMeiser, PJacob, CMontenarh, MValente, S Novel coumarin- and quinolinone-based polycycles as cell division cycle 25-A and -C phosphatases inhibitors induce proliferation arrest and apoptosis in cancer cells. Eur J Med Chem134:316-333 (2017) 
 
M-phase inducer phosphatase 1
Name:M-phase inducer phosphatase 1
Type:Protein
Mol. Mass.:59090.18
Organism:Homo sapiens (Human)
Description:P30304
Residue:524
BDBM50251708
NameBDBM50251708
Synonyms:CHEMBL4067408
TypeSmall organic molecule
Emp. Form.C17H8ClNO3
Mol. Mass.309.703
SMILESClc1ccc2[nH]c(=O)c3c4C(=O)C=CC(=O)c4ccc3c2c1