Reaction Details
TargetM-phase inducer phosphatase 1
LigandBDBM50251724
Substrate/Competitorn/a
Meas. Tech.ChEBML_1684262
IC50 1200±n/a nM
Citation Zwergel, CCzepukojc, BEvain-Bana, EXu, ZStazi, GMori, MPatsilinakos, AMai, ABotta, BRagno, RBagrel, DKirsch, GMeiser, PJacob, CMontenarh, MValente, S Novel coumarin- and quinolinone-based polycycles as cell division cycle 25-A and -C phosphatases inhibitors induce proliferation arrest and apoptosis in cancer cells. Eur J Med Chem134:316-333 (2017) 
 
M-phase inducer phosphatase 1
Name:M-phase inducer phosphatase 1
Type:Protein
Mol. Mass.:59090.18
Organism:Homo sapiens (Human)
Description:P30304
Residue:524
BDBM50251724
NameBDBM50251724
Synonyms:CHEMBL4066424
TypeSmall organic molecule
Emp. Form.C21H17NO4
Mol. Mass.347.364
SMILESCCN(CC)c1ccc2c(c1)oc(=O)c1c3C(=O)C=CC(=O)c3ccc21