Reaction Details
TargetM-phase inducer phosphatase 3
LigandBDBM50251732
Substrate/Competitorn/a
Meas. Tech.ChEBML_1684263
IC50 1440±n/a nM
Citation Zwergel, CCzepukojc, BEvain-Bana, EXu, ZStazi, GMori, MPatsilinakos, AMai, ABotta, BRagno, RBagrel, DKirsch, GMeiser, PJacob, CMontenarh, MValente, S Novel coumarin- and quinolinone-based polycycles as cell division cycle 25-A and -C phosphatases inhibitors induce proliferation arrest and apoptosis in cancer cells. Eur J Med Chem134:316-333 (2017) 
 
M-phase inducer phosphatase 3
Name:M-phase inducer phosphatase 3
Type:Substrate
Mol. Mass.:53366.11
Organism:Homo sapiens (Human)
Description:P30307
Residue:473
BDBM50251732
NameBDBM50251732
Synonyms:CHEMBL4075821
TypeSmall organic molecule
Emp. Form.C17H7ClO4
Mol. Mass.310.688
SMILESClc1ccc2oc(=O)c3c4C(=O)C=CC(=O)c4ccc3c2c1