Reaction Details
TargetToll-like receptor 9
LigandBDBM50252325
Substrate/Competitorn/a
Meas. Tech.ChEBML_1684604
IC50 60±n/a nM
Citation Roy, SMukherjee, APaul, BRahaman, ORoy, SMaithri, GRamya, BPal, SGanguly, DTalukdar, A Design and development of benzoxazole derivatives with toll-like receptor 9 antagonism. Eur J Med Chem134:334-347 (2017) 
 
Toll-like receptor 9
Name:Toll-like receptor 9
Type:Enzyme
Mol. Mass.:115889.91
Organism:Homo sapiens (Human)
Description:Q9NR96
Residue:1032
BDBM50252325
NameBDBM50252325
Synonyms:CHEMBL4071152
TypeSmall organic molecule
Emp. Form.C27H37N5O3
Mol. Mass.479.6144
SMILESNC1CCN(CCCOc2ccc(cc2)-c2nc3ccc(OCCCN4CCC(N)C4)cc3o2)C1