Reaction Details
TargetHistone deacetylase 5
LigandBDBM50380399
Substrate/Competitorn/a
Meas. Tech.ChEBML_1684751
IC50>30000±n/a nM
Citation De Vreese, RD'hooghe, M Synthesis and applications of benzohydroxamic acid-based histone deacetylase inhibitors. Eur J Med Chem135:174-195 (2017) 
 
Histone deacetylase 5
Name:Histone deacetylase 5
Type:Enzyme
Mol. Mass.:121968.61
Organism:Homo sapiens (Human)
Description:Q9UQL6
Residue:1122
BDBM50380399
NameBDBM50380399
Synonyms:CHEMBL2018302 US10227295, Compound Tubastatin A US11207431, Example D US9249087, Tubacin US9956192, Compound Tubastatin-A
TypeSmall organic molecule
Emp. Form.C20H21N3O2
Mol. Mass.335.3996
SMILESCN1CCc2c(C1)c1ccccc1n2Cc1ccc(cc1)C(=O)NO