Reaction Details
TargetGastrin/cholecystokinin type B receptor
LigandBDBM50006838
Substrate/Competitorn/a
Meas. Tech.ChEBML_48261
IC50 26±n/a nM
Citation Yu, MJMcCowan, JRMason, NRDeeter, JBMendelsohn, LG Synthesis and X-ray crystallographic analysis of quinazolinone cholecystokinin/gastrin receptor ligands. J Med Chem35:2534-42 (1992) Gastrin/cholecystokinin type B receptor
Name:Gastrin/cholecystokinin type B receptor
Type:Enzyme Catalytic Domain
Mol. Mass.:49196.59
Organism:MOUSE
Description:Cholecystokinin A CCKBR MOUSE::P56481
Residue:453
BDBM50006838
NameBDBM50006838
Synonyms:2-[2-(1H-Indol-3-yl)-ethyl]-3-(3-isopropoxy-phenyl)-3H-quinazolin-4-one | CHEMBL36206
TypeSmall organic molecule
Emp. Form.C27H25N3O2
Mol. Mass.423.5063
SMILESCC(C)Oc1cccc(c1)-n1c(CCc2c[nH]c3ccccc23)nc2ccccc2c1=O