Reaction Details
TargetFolylpolyglutamate synthase, mitochondrial
LigandBDBM50006905
Substrate/Competitorn/a
Meas. Tech.ChEMBL_68541 (CHEMBL677126)
Ki 2300±n/a nM
Citation Rosowsky, AForsch, RAMoran, RG N-[4-[[(3,4-dihydro-4-oxo-1,2,3-benzotriazin-6- yl)methyl]amino]benzoyl]-L-glutamic acid, a novel A-ring analogue of 2-desamino-5,8-dideazafolic acid. J Med Chem35:2626-30 (1992) Folylpolyglutamate synthase, mitochondrial
Name:Folylpolyglutamate synthase, mitochondrial
Type:PROTEIN
Mol. Mass.:64969.76
Organism:Mus musculus
Description:ChEMBL_68680
Residue:587
BDBM50006905
NameBDBM50006905
Synonyms:2-{4-[(4-Oxo-3,4-dihydro-benzo[d][1,2,3]triazin-6-ylmethyl)-amino]-benzoylamino}-pentanedioic acid | CHEMBL316019
TypeSmall organic molecule
Emp. Form.C20H19N5O6
Mol. Mass.425.3948
SMILESOC(=O)CCC(NC(=O)c1ccc(NCc2ccc3nn[nH]c(=O)c3c2)cc1)C(O)=O