Reaction Details
TargetFolylpolyglutamate synthase, mitochondrial
LigandBDBM50006906
Substrate/Competitorn/a
Meas. Tech.ChEBML_68805
Ki 67±n/a nM
Citation Rosowsky, AForsch, RAMoran, RG N-[4-[[(3,4-dihydro-4-oxo-1,2,3-benzotriazin-6- yl)methyl]amino]benzoyl]-L-glutamic acid, a novel A-ring analogue of 2-desamino-5,8-dideazafolic acid. J Med Chem35:2626-30 (1992) Folylpolyglutamate synthase, mitochondrial
Name:Folylpolyglutamate synthase, mitochondrial
Type:PROTEIN
Mol. Mass.:64969.76
Organism:Mus musculus
Description:ChEMBL_68680
Residue:587
BDBM50006906
NameBDBM50006906
Synonyms:2-{4-[(2-Amino-4-hydroxy-quinazolin-6-ylmethyl)-amino]-benzoylamino}-pentanedioic acid 2-{4-[(2-Amino-4-oxo-3,4-dihydro-quinazolin-6-ylmethyl)-amino]-benzoylamino}-pentanedioic acid | CHEMBL23977
TypeSmall organic molecule
Emp. Form.C21H21N5O6
Mol. Mass.439.4213
SMILESNc1nc2ccc(CNc3ccc(cc3)C(=O)NC(CCC(O)=O)C(O)=O)cc2c(=O)[nH]1