Reaction Details
TargetType-1 angiotensin II receptor B
LigandBDBM50006909
Substrate/Competitorn/a
Meas. Tech.ChEMBL_34815 (CHEMBL648959)
IC50 11±n/a nM
Citation Lin, HSRampersaud, AAZimmerman, KSteinberg, MIBoyd, DB Nonpeptide angiotensin II receptor antagonists: synthetic and computational chemistry of N-[[4-[2-(2H-tetrazol-5-yl)-1-cycloalken-1- yl]phenyl]methyl]imidazole derivatives and their in vitro activity. J Med Chem35:2658-67 (1992) Type-1 angiotensin II receptor B
Name:Type-1 angiotensin II receptor B
Type:Enzyme Catalytic Domain
Mol. Mass.:40929.44
Organism:RAT
Description:Angiotensin II AT1B 0 RAT::P29089
Residue:359
BDBM50006909
NameBDBM50006909
Synonyms:2-Butyl-5-chloro-3-[2'-(1H-tetrazol-5-yl)-biphenyl-4-ylmethyl]-3H-imidazole-4-carboxylic acid 2-Butyl-5-chloro-3-[2'-(2H-tetrazol-5-yl)-biphenyl-4-ylmethyl]-3H-imidazole-4-carboxylic acid CHEMBL907 E 3174 | EXP3174
TypeSmall organic molecule
Emp. Form.C22H21ClN6O2
Mol. Mass.436.894
SMILESCCCCc1nc(Cl)c(C(O)=O)n1Cc1ccc(cc1)-c1ccccc1-c1nnn[nH]1