Reaction Details
TargetAlpha-1A adrenergic receptor
LigandBDBM50006954
Substrate/Competitorn/a
Meas. Tech.ChEMBL_33276 (CHEMBL643614)
Ki 0.53±n/a nM
Citation Russo, FRomeo, GGuccione, SDe Blasi, A Pyrimido[5,4-b]indole derivatives. 1. A new class of potent and selective alpha 1 adrenoceptor ligands. J Med Chem34:1850-4 (1991) Alpha-1A adrenergic receptor
Name:Alpha-1A adrenergic receptor
Type:Protein
Mol. Mass.:51620.15
Organism:Rattus norvegicus (Rat)
Description:P43140
Residue:466
BDBM50006954
NameBDBM50006954
Synonyms:2-{2-[4-(2-Chloro-phenyl)-piperazin-1-yl]-ethyl}-4,9-dihydro-2,4,9-triaza-fluorene-1,3-dione CHEMBL57163
TypeSmall organic molecule
Emp. Form.C22H22ClN5O2
Mol. Mass.423.895
SMILESClc1ccccc1N1CCN(CCn2c(=O)[nH]c3c4ccccc4[nH]c3c2=O)CC1