Reaction Details
TargetSigma non-opioid intracellular receptor 1
LigandBDBM50006986
Substrate/Competitorn/a
Meas. Tech.ChEMBL_201262 (CHEMBL804880)
IC50 3.2±n/a nM
Citation Wilson, AADannals, RFRavert, HTSonders, MSWeber, EWagner, HN Radiosynthesis of sigma receptor ligands for positron emission tomography: 11C- and 18F-labeled guanidines. J Med Chem34:1867-70 (1991) Sigma non-opioid intracellular receptor 1
Name:Sigma non-opioid intracellular receptor 1
Type:Enzyme Catalytic Domain
Mol. Mass.:25124.85
Organism:Homo sapiens (Human)
Description:Q99720
Residue:223
BDBM50006986
NameBDBM50006986
Synonyms:CHEMBL442356 | N-Adamantan-1-yl-N'-(4-fluoro-2-methyl-phenyl)-guanidine
TypeSmall organic molecule
Emp. Form.C18H24FN3
Mol. Mass.301.4017
SMILESCc1cc(F)ccc1N=C(N)NC12CC3CC(CC(C3)C1)C2