Reaction Details
TargetSigma non-opioid intracellular receptor 1
LigandBDBM81924
Substrate/Competitorn/a
Meas. Tech.ChEMBL_201262 (CHEMBL804880)
IC50 76±n/a nM
Citation Wilson, AADannals, RFRavert, HTSonders, MSWeber, EWagner, HN Radiosynthesis of sigma receptor ligands for positron emission tomography: 11C- and 18F-labeled guanidines. J Med Chem34:1867-70 (1991) Sigma non-opioid intracellular receptor 1
Name:Sigma non-opioid intracellular receptor 1
Type:Enzyme Catalytic Domain
Mol. Mass.:25124.85
Organism:Homo sapiens (Human)
Description:Q99720
Residue:223
BDBM81924
NameBDBM81924
Synonyms:(R)-3-(1-Propyl-piperidin-3-yl)-phenol CAS_85976-54-1 NSC_202477 PPP, S(-)-3
TypeSmall organic molecule
Emp. Form.C14H21NO
Mol. Mass.219.3226
SMILESCCCN1CCCC(C1)c1cccc(O)c1