Reaction Details
TargetKappa-type opioid receptor
LigandBDBM50007002
Substrate/Competitorn/a
Meas. Tech.ChEMBL_145370 (CHEMBL753138)
IC50 56±n/a nM
Citation Freeman, JPMichalson, ETD'Andrea, SVBaczynskyj, LVon Voigtlander, PFLahti, RASmith, MWLawson, CFScahill, TAMizsak, SA Naphtho and benzo analogues of the kappa opioid agonist trans-(+/-)-3,4-dichloro-N-methyl-N-[2-(1-pyrrolidinyl)cyclohexyl] benzeneacetamide. J Med Chem34:1891-6 (1991) Kappa-type opioid receptor
Name:Kappa-type opioid receptor
Type:Enzyme
Mol. Mass.:42656.78
Organism:Mus musculus (Mouse)
Description:P33534
Residue:380
BDBM50007002
NameBDBM50007002
Synonyms:3,4-Dichloro-N-(3-dimethylamino-1,2,3,4-tetrahydro-naphthalen-2-yl)-N-methyl-benzamide | CHEMBL296184
TypeSmall organic molecule
Emp. Form.C20H22Cl2N2O
Mol. Mass.377.307
SMILESCN(C)[C@@H]1Cc2ccccc2C[C@H]1N(C)C(=O)c1ccc(Cl)c(Cl)c1