Reaction Details
TargetPolyunsaturated fatty acid 5-lipoxygenase
LigandBDBM50007052
Substrate/Competitorn/a
Meas. Tech.ChEBML_3863
IC50 6±n/a nM
Citation Bird, naBruneau, PCrawley, GCEdwards, MPFoster, SJGirodeau, JMKingston, JFMcMillan, RM (Methoxyalkyl)thiazoles: a new series of potent, selective, and orally active 5-lipoxygenase inhibitors displaying high enantioselectivity. J Med Chem34:2176-86 (1991) Polyunsaturated fatty acid 5-lipoxygenase
Name:Polyunsaturated fatty acid 5-lipoxygenase
Type:PROTEIN
Mol. Mass.:77961.27
Organism:Mus musculus
Description:ChEMBL_675639
Residue:674
BDBM50007052
NameBDBM50007052
Synonyms:1-[3-(3-Phenyl-allyloxy)-phenyl]-1-thiazol-2-yl-propan-1-ol | CHEMBL70054
TypeSmall organic molecule
Emp. Form.C21H21NO2S
Mol. Mass.351.462
SMILESCCC(O)(c1nccs1)c1cccc(OC\C=C\c2ccccc2)c1