Reaction Details
TargetPolyunsaturated fatty acid 5-lipoxygenase
LigandBDBM50000832
Substrate/Competitorn/a
Meas. Tech.ChEMBL_3863 (CHEMBL618767)
IC50 5±n/a nM
Citation Bird, naBruneau, PCrawley, GCEdwards, MPFoster, SJGirodeau, JMKingston, JFMcMillan, RM (Methoxyalkyl)thiazoles: a new series of potent, selective, and orally active 5-lipoxygenase inhibitors displaying high enantioselectivity. J Med Chem34:2176-86 (1991) Polyunsaturated fatty acid 5-lipoxygenase
Name:Polyunsaturated fatty acid 5-lipoxygenase
Type:PROTEIN
Mol. Mass.:77961.27
Organism:Mus musculus
Description:ChEMBL_675639
Residue:674
BDBM50000832
NameBDBM50000832
Synonyms:2-{1-Methoxy-1-[3-(naphthalen-2-ylmethoxy)-phenyl]-ethyl}-thiazole | CHEMBL70191
TypeSmall organic molecule
Emp. Form.C23H21NO2S
Mol. Mass.375.483
SMILESCOC(C)(c1nccs1)c1cccc(OCc2ccc3ccccc3c2)c1