Reaction Details
TargetCarbonic anhydrase 1
LigandBDBM10880
Substrate/Competitorn/a
Meas. Tech.ChEMBL_1685227 (CHEMBL4035706)
IC50 5.8±n/a nM
Citation Alt?ntop, MDSever, BÖzdemir, AKucukoglu, KOnem, HNadaroglu, HKaplanc?kl?, ZA Potential inhibitors of human carbonic anhydrase isozymes I and II: Design, synthesis and docking studies of new 1,3,4-thiadiazole derivatives. Bioorg Med Chem25:3547-3554 (2017) 
 
Carbonic anhydrase 1
Name:Carbonic anhydrase 1
Type:Enzyme
Mol. Mass.:28873.37
Organism:Homo sapiens (Human)
Description:P00915
Residue:261
BDBM10880
NameBDBM10880
Synonyms:AZA AZM acetazolamide Acetazolamide Acetazolamide (AZA) Acetazolamide, 5 Acetazolamide, AZA CHEMBL20 Sulfonamide, 1 US11278534, Example acetazolamide sulfonamide 1
TypeSmall organic molecule
Emp. Form.C4H6N4O3S2
Mol. Mass.222.245
SMILESCC(=O)Nc1nnc(s1)S(N)(=O)=O