Reaction Details
TargetCarbonic anhydrase 2
LigandBDBM81920
Substrate/Competitorn/a
Meas. Tech.ChEBML_1685272
Ki 2.0±n/a nM
Citation Del Prete, SVullo, DOsman, SMAlOthman, ZSupuran, CTCapasso, C Sulfonamide inhibition profiles of the?-carbonic anhydrase from the pathogenic bacterium Francisella tularensis responsible of the febrile illness tularemia. Bioorg Med Chem25:3555-3561 (2017) 
 
Carbonic anhydrase 2
Name:Carbonic anhydrase 2
Type:Enzyme
Mol. Mass.:29250.71
Organism:Homo sapiens (Human)
Description:P00918
Residue:260
BDBM81920
NameBDBM81920
Synonyms:p-Hydroxy-benzene derivative, 3a
TypeSmall organic molecule
Emp. Form.C6H7NO3S
Mol. Mass.173.19
SMILESNS(=O)(=O)c1ccc(O)cc1