Reaction Details
TargetCytochrome P450 3A4
LigandBDBM50253091
Substrate/Competitorn/a
Meas. Tech.ChEBML_1685398
IC50>30000±n/a nM
Citation Tarr, JCWood, MRNoetzel, MJBertron, JLWeiner, RLRodriguez, ALLamsal, AByers, FWChang, SCho, HPJones, CKNiswender, CMWood, MWBrandon, NJDuggan, MEConn, PJBridges, TMLindsley, CW Challenges in the development of an M Bioorg Med Chem Lett27:2990-2995 (2017) 
 
Cytochrome P450 3A4
Name:Cytochrome P450 3A4
Type:Enzyme
Mol. Mass.:57349.57
Organism:Homo sapiens (Human)
Description:n/a
Residue:503
BDBM50253091
NameBDBM50253091
Synonyms:CHEMBL4083081
TypeSmall organic molecule
Emp. Form.C18H17F3N6OS
Mol. Mass.422.427
SMILESCc1nnc2sc(C(=O)NC3CN(C3)c3ccc(nc3)C(F)(F)F)c(N)c2c1C