Reaction Details
TargetDelta-type opioid receptor
LigandBDBM50253140
Substrate/Competitorn/a
Meas. Tech.ChEMBL_1685452 (CHEMBL4035931)
EC50 1.2±n/a nM
Citation Hayashida, KHirayama, SIwai, TWatanabe, YTakahashi, TSakai, JNakata, EYamakawa, TFujii, HNagase, H Novel delta opioid receptor agonists with oxazatricyclodecane structure showing potent agonistic activities. Bioorg Med Chem Lett27:2742-2745 (2017) 
 
Delta-type opioid receptor
Name:Delta-type opioid receptor
Type:G Protein-Coupled Receptor (GPCR)
Mol. Mass.:40382.98
Organism:Homo sapiens (Human)
Description:Competition binding assays were carried out using membrane preparations from transfected HN9.10 cells that constitutively expressed the delta opioid receptor.
Residue:372
BDBM50253140
NameBDBM50253140
Synonyms:CHEMBL4081856
TypeSmall organic molecule
Emp. Form.C28H32N2O4S
Mol. Mass.492.63
SMILES[H][C@]12CN(C3CCC4(O1)C1Cc5ccc(O)cc5C4(CCN1CC1CC1)C23)S(=O)(=O)c1ccccc1