Reaction Details
TargetKappa-type opioid receptor
LigandBDBM50253158
Substrate/Competitorn/a
Meas. Tech.ChEMBL_1685448 (CHEMBL4035927)
Ki 1.4±n/a nM
Citation Hayashida, KHirayama, SIwai, TWatanabe, YTakahashi, TSakai, JNakata, EYamakawa, TFujii, HNagase, H Novel delta opioid receptor agonists with oxazatricyclodecane structure showing potent agonistic activities. Bioorg Med Chem Lett27:2742-2745 (2017) 
 
Kappa-type opioid receptor
Name:Kappa-type opioid receptor
Type:G Protein-Coupled Receptor (GPCR)
Mol. Mass.:42648.76
Organism:Homo sapiens (Human)
Description:P41145
Residue:380
BDBM50253158
NameBDBM50253158
Synonyms:CHEMBL4100943
TypeSmall organic molecule
Emp. Form.C29H34N2O2
Mol. Mass.442.5925
SMILES[H][C@]12CN(Cc3ccccc3)C3CCC4(O1)C1Cc5ccc(O)cc5C4(CCN1CC1CC1)C23