Reaction Details
TargetMu-type opioid receptor
LigandBDBM50253138
Substrate/Competitorn/a
Meas. Tech.ChEBML_1685442
Ki 0.383000±n/a nM
Citation Hayashida, KHirayama, SIwai, TWatanabe, YTakahashi, TSakai, JNakata, EYamakawa, TFujii, HNagase, H Novel delta opioid receptor agonists with oxazatricyclodecane structure showing potent agonistic activities. Bioorg Med Chem Lett27:2742-2745 (2017) 
 
Mu-type opioid receptor
Name:Mu-type opioid receptor
Type:Enzyme Catalytic Domain
Mol. Mass.:44431.62
Organism:MOUSE
Description:OPIATE Mu OPRM1 MOUSE::P42866
Residue:398
BDBM50253138
NameBDBM50253138
Synonyms:CHEMBL4076303
TypeSmall organic molecule
Emp. Form.C26H28N2O3
Mol. Mass.416.5121
SMILES[H][C@]12CN(C3CCC4(O1)C1Cc5ccc(O)cc5C4(CCN1C)C23)C(=O)c1ccccc1