Reaction Details
TargetD(1A) dopamine receptor
LigandBDBM50007138
Substrate/Competitorn/a
Meas. Tech.ChEBML_60521
Ki 329±n/a nM
Citation DeNinno, MPSchoenleber, RPerner, RJLijewski, LAsin, KEBritton, DRMacKenzie, RKebabian, JW Synthesis and dopaminergic activity of 3-substituted 1-(aminomethyl)-3,4-dihydro-5,6-dihydroxy-1H-2-benzopyrans: characterization of an auxiliary binding region in the D1 receptor. J Med Chem34:2561-9 (1991) D(1A) dopamine receptor
Name:D(1A) dopamine receptor
Type:Enzyme Catalytic Domain
Mol. Mass.:49429.75
Organism:RAT
Description:P18901
Residue:446
BDBM50007138
NameBDBM50007138
Synonyms:3-Cyclohexyl-1-cyclopropylaminomethyl-isochroman-5,6-diol | CHEMBL86669
TypeSmall organic molecule
Emp. Form.C19H27NO3
Mol. Mass.317.4226
SMILESOc1ccc2[C@H](CNC3CC3)OC(Cc2c1O)C1CCCCC1