Reaction Details
TargetD(1A) dopamine receptor
LigandBDBM50007147
Substrate/Competitorn/a
Meas. Tech.ChEBML_60521
Ki 32±n/a nM
Citation DeNinno, MPSchoenleber, RPerner, RJLijewski, LAsin, KEBritton, DRMacKenzie, RKebabian, JW Synthesis and dopaminergic activity of 3-substituted 1-(aminomethyl)-3,4-dihydro-5,6-dihydroxy-1H-2-benzopyrans: characterization of an auxiliary binding region in the D1 receptor. J Med Chem34:2561-9 (1991) D(1A) dopamine receptor
Name:D(1A) dopamine receptor
Type:Enzyme Catalytic Domain
Mol. Mass.:49429.75
Organism:RAT
Description:P18901
Residue:446
BDBM50007147
NameBDBM50007147
Synonyms:3-Adamantan-1-yl-1-aminomethyl-isochroman-5,6-diol | CHEMBL313530
TypeSmall organic molecule
Emp. Form.C20H27NO3
Mol. Mass.329.4333
SMILESNC[C@@H]1OC(Cc2c(O)c(O)ccc12)C12C[C@H]3C[C@H](C[C@H](C3)C1)C2