Reaction Details
TargetCarbonic anhydrase 1
LigandBDBM50253214
Substrate/Competitorn/a
Meas. Tech.ChEBML_1685486
Ki 86±n/a nM
Citation Angeli, ACarta, FBartolucci, GSupuran, CT Synthesis of novel acyl selenoureido benzensulfonamides as carbonic anhydrase I, II, VII and IX inhibitors. Bioorg Med Chem25:3567-3573 (2017) 
 
Carbonic anhydrase 1
Name:Carbonic anhydrase 1
Type:Enzyme
Mol. Mass.:28873.37
Organism:Homo sapiens (Human)
Description:P00915
Residue:261
BDBM50253214
NameBDBM50253214
Synonyms:CHEMBL4066350
TypeSmall organic molecule
Emp. Form.C16H15N3O5SSe
Mol. Mass.440.33
SMILESCC(=O)Oc1ccccc1C(=O)NC(=[Se])Nc1ccc(cc1)S(N)(=O)=O