Reaction Details
TargetCarbonic anhydrase 9
LigandBDBM50253220
Substrate/Competitorn/a
Meas. Tech.ChEBML_1685489
Ki 81±n/a nM
Citation Angeli, ACarta, FBartolucci, GSupuran, CT Synthesis of novel acyl selenoureido benzensulfonamides as carbonic anhydrase I, II, VII and IX inhibitors. Bioorg Med Chem25:3567-3573 (2017) 
 
Carbonic anhydrase 9
Name:Carbonic anhydrase 9
Type:Enzyme
Mol. Mass.:49669.03
Organism:Homo sapiens (Human)
Description:Catalytic domain of human cloned isozyme was used in the assay
Residue:459
BDBM50253220
NameBDBM50253220
Synonyms:CHEMBL4082685
TypeSmall organic molecule
Emp. Form.C16H15N3O6SSe
Mol. Mass.456.33
SMILESCC(=O)Oc1ccccc1C(=O)NC(=[Se])Nc1cc(ccc1O)S(N)(=O)=O