Reaction Details
TargetCarbonic anhydrase 9
LigandBDBM50253233
Substrate/Competitorn/a
Meas. Tech.ChEBML_1685489
Ki 44±n/a nM
Citation Angeli, ACarta, FBartolucci, GSupuran, CT Synthesis of novel acyl selenoureido benzensulfonamides as carbonic anhydrase I, II, VII and IX inhibitors. Bioorg Med Chem25:3567-3573 (2017) 
 
Carbonic anhydrase 9
Name:Carbonic anhydrase 9
Type:Enzyme
Mol. Mass.:49669.03
Organism:Homo sapiens (Human)
Description:Catalytic domain of human cloned isozyme was used in the assay
Residue:459
BDBM50253233
NameBDBM50253233
Synonyms:CHEMBL4063591
TypeSmall organic molecule
Emp. Form.C15H15N3O3SSe
Mol. Mass.396.32
SMILESCc1cccc(c1)C(=O)NC(=[Se])Nc1cccc(c1)S(N)(=O)=O