Reaction Details
TargetCarbonic anhydrase 9
LigandBDBM50253215
Substrate/Competitorn/a
Meas. Tech.ChEBML_1685489
Ki 3.5±n/a nM
Citation Angeli, ACarta, FBartolucci, GSupuran, CT Synthesis of novel acyl selenoureido benzensulfonamides as carbonic anhydrase I, II, VII and IX inhibitors. Bioorg Med Chem25:3567-3573 (2017) 
 
Carbonic anhydrase 9
Name:Carbonic anhydrase 9
Type:Enzyme
Mol. Mass.:49669.03
Organism:Homo sapiens (Human)
Description:Catalytic domain of human cloned isozyme was used in the assay
Residue:459
BDBM50253215
NameBDBM50253215
Synonyms:CHEMBL4093916
TypeSmall organic molecule
Emp. Form.C15H11BrF3N3O4SSe
Mol. Mass.545.19
SMILESNS(=O)(=O)c1ccc(NC(=[Se])NC(=O)c2cc(Br)cc(OC(F)(F)F)c2)cc1