Reaction Details
TargetCarbonic anhydrase 7
LigandBDBM50253220
Substrate/Competitorn/a
Meas. Tech.ChEBML_1685488
Ki 56±n/a nM
Citation Angeli, ACarta, FBartolucci, GSupuran, CT Synthesis of novel acyl selenoureido benzensulfonamides as carbonic anhydrase I, II, VII and IX inhibitors. Bioorg Med Chem25:3567-3573 (2017) 
 
Carbonic anhydrase 7
Name:Carbonic anhydrase 7
Type:Enzyme
Mol. Mass.:29664.11
Organism:Homo sapiens (Human)
Description:Human cloned isozyme.
Residue:264
BDBM50253220
NameBDBM50253220
Synonyms:CHEMBL4082685
TypeSmall organic molecule
Emp. Form.C16H15N3O6SSe
Mol. Mass.456.33
SMILESCC(=O)Oc1ccccc1C(=O)NC(=[Se])Nc1cc(ccc1O)S(N)(=O)=O