Reaction Details
TargetCarbonic anhydrase 1
LigandBDBM50253232
Substrate/Competitorn/a
Meas. Tech.ChEBML_1685486
Ki 62±n/a nM
Citation Angeli, ACarta, FBartolucci, GSupuran, CT Synthesis of novel acyl selenoureido benzensulfonamides as carbonic anhydrase I, II, VII and IX inhibitors. Bioorg Med Chem25:3567-3573 (2017) 
 
Carbonic anhydrase 1
Name:Carbonic anhydrase 1
Type:Enzyme
Mol. Mass.:28873.37
Organism:Homo sapiens (Human)
Description:P00915
Residue:261
BDBM50253232
NameBDBM50253232
Synonyms:CHEMBL4072192
TypeSmall organic molecule
Emp. Form.C14H13N3O3SSe
Mol. Mass.382.3
SMILESNS(=O)(=O)c1ccccc1NC(=[Se])NC(=O)c1ccccc1