Reaction Details
TargetCarbonic anhydrase 1
LigandBDBM50253233
Substrate/Competitorn/a
Meas. Tech.ChEBML_1685486
Ki 82±n/a nM
Citation Angeli, ACarta, FBartolucci, GSupuran, CT Synthesis of novel acyl selenoureido benzensulfonamides as carbonic anhydrase I, II, VII and IX inhibitors. Bioorg Med Chem25:3567-3573 (2017) 
 
Carbonic anhydrase 1
Name:Carbonic anhydrase 1
Type:Enzyme
Mol. Mass.:28873.37
Organism:Homo sapiens (Human)
Description:P00915
Residue:261
BDBM50253233
NameBDBM50253233
Synonyms:CHEMBL4063591
TypeSmall organic molecule
Emp. Form.C15H15N3O3SSe
Mol. Mass.396.32
SMILESCc1cccc(c1)C(=O)NC(=[Se])Nc1cccc(c1)S(N)(=O)=O