Reaction Details
TargetCarbonic anhydrase 2
LigandBDBM50253215
Substrate/Competitorn/a
Meas. Tech.ChEBML_1685487
Ki 0.700000±n/a nM
Citation Angeli, ACarta, FBartolucci, GSupuran, CT Synthesis of novel acyl selenoureido benzensulfonamides as carbonic anhydrase I, II, VII and IX inhibitors. Bioorg Med Chem25:3567-3573 (2017) 
 
Carbonic anhydrase 2
Name:Carbonic anhydrase 2
Type:Enzyme
Mol. Mass.:29250.71
Organism:Homo sapiens (Human)
Description:P00918
Residue:260
BDBM50253215
NameBDBM50253215
Synonyms:CHEMBL4093916
TypeSmall organic molecule
Emp. Form.C15H11BrF3N3O4SSe
Mol. Mass.545.19
SMILESNS(=O)(=O)c1ccc(NC(=[Se])NC(=O)c2cc(Br)cc(OC(F)(F)F)c2)cc1