Reaction Details
TargetCarbonic anhydrase 2
LigandBDBM50253217
Substrate/Competitorn/a
Meas. Tech.ChEBML_1685487
Ki 27±n/a nM
Citation Angeli, ACarta, FBartolucci, GSupuran, CT Synthesis of novel acyl selenoureido benzensulfonamides as carbonic anhydrase I, II, VII and IX inhibitors. Bioorg Med Chem25:3567-3573 (2017) 
 
Carbonic anhydrase 2
Name:Carbonic anhydrase 2
Type:Enzyme
Mol. Mass.:29250.71
Organism:Homo sapiens (Human)
Description:P00918
Residue:260
BDBM50253217
NameBDBM50253217
Synonyms:CHEMBL4067394
TypeSmall organic molecule
Emp. Form.C17H17N3O5SSe
Mol. Mass.454.36
SMILESNS(=O)(=O)c1ccc(CCNC(=[Se])NC(=O)c2ccc3OCOc3c2)cc1