Reaction Details
TargetCarbonic anhydrase 9
LigandBDBM50253236
Substrate/Competitorn/a
Meas. Tech.ChEBML_1685489
Ki 69±n/a nM
Citation Angeli, ACarta, FBartolucci, GSupuran, CT Synthesis of novel acyl selenoureido benzensulfonamides as carbonic anhydrase I, II, VII and IX inhibitors. Bioorg Med Chem25:3567-3573 (2017) 
 
Carbonic anhydrase 9
Name:Carbonic anhydrase 9
Type:Enzyme
Mol. Mass.:49669.03
Organism:Homo sapiens (Human)
Description:Catalytic domain of human cloned isozyme was used in the assay
Residue:459
BDBM50253236
NameBDBM50253236
Synonyms:CHEMBL4100673
TypeSmall organic molecule
Emp. Form.C20H17N3O4SSe
Mol. Mass.474.39
SMILESNS(=O)(=O)c1ccc(O)c(NC(=[Se])NC(=O)c2ccc(cc2)-c2ccccc2)c1