Reaction Details
TargetCarbonic anhydrase 9
LigandBDBM50253214
Substrate/Competitorn/a
Meas. Tech.ChEBML_1685489
Ki 14±n/a nM
Citation Angeli, ACarta, FBartolucci, GSupuran, CT Synthesis of novel acyl selenoureido benzensulfonamides as carbonic anhydrase I, II, VII and IX inhibitors. Bioorg Med Chem25:3567-3573 (2017) 
 
Carbonic anhydrase 9
Name:Carbonic anhydrase 9
Type:Enzyme
Mol. Mass.:49669.03
Organism:Homo sapiens (Human)
Description:Catalytic domain of human cloned isozyme was used in the assay
Residue:459
BDBM50253214
NameBDBM50253214
Synonyms:CHEMBL4066350
TypeSmall organic molecule
Emp. Form.C16H15N3O5SSe
Mol. Mass.440.33
SMILESCC(=O)Oc1ccccc1C(=O)NC(=[Se])Nc1ccc(cc1)S(N)(=O)=O