Reaction Details
TargetCarbonic anhydrase 9
LigandBDBM50253242
Substrate/Competitorn/a
Meas. Tech.ChEBML_1685489
Ki 4.6±n/a nM
Citation Angeli, ACarta, FBartolucci, GSupuran, CT Synthesis of novel acyl selenoureido benzensulfonamides as carbonic anhydrase I, II, VII and IX inhibitors. Bioorg Med Chem25:3567-3573 (2017) 
 
Carbonic anhydrase 9
Name:Carbonic anhydrase 9
Type:Enzyme
Mol. Mass.:49669.03
Organism:Homo sapiens (Human)
Description:Catalytic domain of human cloned isozyme was used in the assay
Residue:459
BDBM50253242
NameBDBM50253242
Synonyms:CHEMBL4080767
TypeSmall organic molecule
Emp. Form.C14H13N3O3SSe
Mol. Mass.382.3
SMILESNS(=O)(=O)c1ccc(NC(=[Se])NC(=O)c2ccccc2)cc1