Reaction Details
TargetDelta-type opioid receptor
LigandBDBM50453089
Substrate/Competitorn/a
Meas. Tech.ChEMBL_146437 (CHEMBL757334)
Ki>1000±n/a nM
Citation Vecchietti, VClarke, GDColle, RGiardina, GPetrone, GSbacchi, M (1S)-1-(aminomethyl)-2-(arylacetyl)-1,2,3,4-tetrahydroisoquinoline and heterocycle-condensed tetrahydropyridine derivatives: members of a novel class of very potent kappa opioid analgesics. J Med Chem34:2624-33 (1991) Delta-type opioid receptor
Name:Delta-type opioid receptor
Type:G Protein-Coupled Receptor (GPCR)
Mol. Mass.:40382.98
Organism:Homo sapiens (Human)
Description:Competition binding assays were carried out using membrane preparations from transfected HN9.10 cells that constitutively expressed the delta opioid receptor.
Residue:372
BDBM50453089
NameBDBM50453089
Synonyms:CHEMBL2114225
TypeSmall organic molecule
Emp. Form.C23H25F3N2O
Mol. Mass.402.4526
SMILESFC(F)(F)c1ccc(CC(=O)N2CCc3ccccc3[C@H]2CN2CCCC2)cc1